Determining projects to restore... All projects are up-to-date for restore. /private/tmp/RtkDotnetSmoke/Broken.cs(7,17): error CS1525: Invalid expression term ';' [/private/tmp/RtkDotnetSmoke/RtkDotnetSmoke.csproj] Build FAILED. /private/tmp/RtkDotnetSmoke/Broken.cs(7,17): error CS1525: Invalid expression term ';' [/private/tmp/RtkDotnetSmoke/RtkDotnetSmoke.csproj] 0 Warning(s) 1 Error(s) Time Elapsed 00:00:00.76